Reaction Details
TargetMitogen-activated protein kinase 10
LigandBDBM50072727
Substrate/Competitorn/a
Meas. Tech.ChEMBL_1467105 (CHEMBL3411302)
IC50>10000±n/a nM
Citation Yin, YZheng, KEid, NHoward, SJeong, JHYi, FGuo, JPark, CMBibian, MWu, WHernandez, PPark, HWu, YLuo, JLLoGrasso, PVFeng, Y Bis-aryl urea derivatives as potent and selective LIM kinase (Limk) inhibitors. J Med Chem58:1846-61 (2015) 
 
Mitogen-activated protein kinase 10
Name:Mitogen-activated protein kinase 10
Type:Enzyme
Mol. Mass.:52586.89
Organism:Homo sapiens (Human)
Description:n/a
Residue:464
BDBM50072727
NameBDBM50072727
Synonyms:CHEMBL3410054
TypeSmall organic molecule
Emp. Form.C23H22ClFN6O
Mol. Mass.452.912
SMILESCc1[nH]c2ncnc(-c3ccc(NC(=O)N(CCN)c4ccc(Cl)cc4)c(F)c3)c2c1C