Reaction Details
TargetDual specificity protein kinase TTK
LigandBDBM50072902
Substrate/Competitorn/a
Meas. Tech.ChEMBL_1467137 (CHEMBL3411334)
IC50 3.6±n/a nM
Citation Kusakabe, KIde, NDaigo, YItoh, TYamamoto, THashizume, HNozu, KYoshida, HTadano, GTagashira, SHigashino, KOkano, YSato, YInoue, MIguchi, MKanazawa, TIshioka, YDohi, KKido, YSakamoto, SAndo, SMaeda, MHigaki, MBaba, YNakamura, Y Discovery of imidazo[1,2-b]pyridazine derivatives: selective and orally available Mps1 (TTK) kinase inhibitors exhibiting remarkable antiproliferative activity. J Med Chem58:1760-75 (2015) 
 
Dual specificity protein kinase TTK
Name:Dual specificity protein kinase TTK
Type:Protein
Mol. Mass.:97086.79
Organism:Homo sapiens (Human)
Description:P33981
Residue:857
BDBM50072902
NameBDBM50072902
Synonyms:CHEMBL3410075
TypeSmall organic molecule
Emp. Form.C28H29N5O3
Mol. Mass.483.5616
SMILESO=C(NC1CC1)c1ccc(cc1)-c1cnc2c(NCC3CCOCC3)cc(Oc3ccccc3)nn12