Reaction Details
TargetDual specificity protein kinase TTK
LigandBDBM50072905
Substrate/Competitorn/a
Meas. Tech.ChEMBL_1467137 (CHEMBL3411334)
IC50 0.300000±n/a nM
Citation Kusakabe, KIde, NDaigo, YItoh, TYamamoto, THashizume, HNozu, KYoshida, HTadano, GTagashira, SHigashino, KOkano, YSato, YInoue, MIguchi, MKanazawa, TIshioka, YDohi, KKido, YSakamoto, SAndo, SMaeda, MHigaki, MBaba, YNakamura, Y Discovery of imidazo[1,2-b]pyridazine derivatives: selective and orally available Mps1 (TTK) kinase inhibitors exhibiting remarkable antiproliferative activity. J Med Chem58:1760-75 (2015) 
 
Dual specificity protein kinase TTK
Name:Dual specificity protein kinase TTK
Type:Protein
Mol. Mass.:97086.79
Organism:Homo sapiens (Human)
Description:P33981
Residue:857
BDBM50072905
NameBDBM50072905
Synonyms:CHEMBL3410078
TypeSmall organic molecule
Emp. Form.C28H29N5O4
Mol. Mass.499.561
SMILESOc1ccccc1Oc1cc(NCC2CCOCC2)c2ncc(-c3ccc(cc3)C(=O)NC3CC3)n2n1