Reaction Details
TargetSerine/threonine-protein kinase mTOR
LigandBDBM50072961
Substrate/Competitorn/a
Meas. Tech.ChEMBL_1468015 (CHEMBL3413521)
IC50 1.5±n/a nM
Citation Pike, KGMorris, JRuston, LPass, SLGreenwood, RWilliams, EJDemeritt, JCulshaw, JDGill, KPass, MFinlay, MRGood, CJRoberts, CACurrie, GSBlades, KEden, JMPearson, SE Discovery of AZD3147: a potent, selective dual inhibitor of mTORC1 and mTORC2. J Med Chem58:2326-49 (2015) 
 
Serine/threonine-protein kinase mTOR
Name:Serine/threonine-protein kinase mTOR
Type:Rapamycin target protein
Mol. Mass.:288917.12
Organism:Homo sapiens (Human)
Description:P42345
Residue:2549
BDBM50072961
NameBDBM50072961
Synonyms:CHEMBL3410672
TypeSmall organic molecule
Emp. Form.C24H31N5O4S2
Mol. Mass.517.664
SMILESC[C@H]1COCCN1c1cc(nc(n1)-c1ccc(NC(=S)NCCO)cc1)C1(CC1)S(=O)(=O)C1CC1