Reaction Details
TargetSerine/threonine-protein kinase mTOR
LigandBDBM50072963
Substrate/Competitorn/a
Meas. Tech.ChEMBL_1468015 (CHEMBL3413521)
IC50 5.8±n/a nM
Citation Pike, KGMorris, JRuston, LPass, SLGreenwood, RWilliams, EJDemeritt, JCulshaw, JDGill, KPass, MFinlay, MRGood, CJRoberts, CACurrie, GSBlades, KEden, JMPearson, SE Discovery of AZD3147: a potent, selective dual inhibitor of mTORC1 and mTORC2. J Med Chem58:2326-49 (2015) 
 
Serine/threonine-protein kinase mTOR
Name:Serine/threonine-protein kinase mTOR
Type:Rapamycin target protein
Mol. Mass.:288917.12
Organism:Homo sapiens (Human)
Description:P42345
Residue:2549
BDBM50072963
NameBDBM50072963
Synonyms:CHEMBL3410548
TypeSmall organic molecule
Emp. Form.C20H27N5O5S
Mol. Mass.449.524
SMILESC[C@H]1COCCN1c1cc(CS(C)(=O)=O)nc(n1)-c1ccc(NC(=O)NCCO)cc1