Reaction Details
TargetCannabinoid receptor 2
LigandBDBM50380896
Substrate/Competitorn/a
Meas. Tech.ChEMBL_1468240 (CHEMBL3411783)
Ki 6.7±n/a nM
Citation Han, SZhang, FFQian, HYChen, LLPu, JBXie, XChen, JZ Design, syntheses, structure-activity relationships and docking studies of coumarin derivatives as novel selective ligands for the CB2 receptor. Eur J Med Chem93:16-32 (2015) 
 
Cannabinoid receptor 2
Name:Cannabinoid receptor 2
Type:G Protein-Coupled Receptor (GPCR)
Mol. Mass.:39690.94
Organism:Homo sapiens (Human)
Description:P34972
Residue:360
BDBM50380896
NameBDBM50380896
Synonyms:CHEMBL2019081
TypeSmall organic molecule
Emp. Form.C26H38N2O4
Mol. Mass.442.5909
SMILESOC(=O)C1(CCCCC1)NC(=O)c1cc2CCCCCCc2n(CC2CCCCC2)c1=O