Reaction Details
TargetCannabinoid receptor 1
LigandBDBM50073013
Substrate/Competitorn/a
Meas. Tech.ChEMBL_1468235 (CHEMBL3411778)
EC50>10000±n/a nM
Citation Han, SZhang, FFQian, HYChen, LLPu, JBXie, XChen, JZ Design, syntheses, structure-activity relationships and docking studies of coumarin derivatives as novel selective ligands for the CB2 receptor. Eur J Med Chem93:16-32 (2015) 
 
Cannabinoid receptor 1
Name:Cannabinoid receptor 1
Type:G Protein-Coupled Receptor (GPCR)
Mol. Mass.:52868.96
Organism:Homo sapiens (Human)
Description:P21554
Residue:472
BDBM50073013
NameBDBM50073013
Synonyms:CHEMBL3410700
TypeSmall organic molecule
Emp. Form.C21H21NO4
Mol. Mass.351.3957
SMILESCCCCOc1cccc2cc(C(=O)NCc3ccccc3)c(=O)oc12