Reaction Details
TargetCannabinoid receptor 2
LigandBDBM50073014
Substrate/Competitorn/a
Meas. Tech.ChEMBL_1468236 (CHEMBL3411779)
EC50 793±n/a nM
Citation Han, SZhang, FFQian, HYChen, LLPu, JBXie, XChen, JZ Design, syntheses, structure-activity relationships and docking studies of coumarin derivatives as novel selective ligands for the CB2 receptor. Eur J Med Chem93:16-32 (2015) 
 
Cannabinoid receptor 2
Name:Cannabinoid receptor 2
Type:G Protein-Coupled Receptor (GPCR)
Mol. Mass.:39690.94
Organism:Homo sapiens (Human)
Description:P34972
Residue:360
BDBM50073014
NameBDBM50073014
Synonyms:CHEMBL3410701
TypeSmall organic molecule
Emp. Form.C19H23NO4
Mol. Mass.329.3902
SMILESCCCCOc1cccc2cc(C(=O)NC3CCCC3)c(=O)oc12