Reaction Details
TargetCannabinoid receptor 2
LigandBDBM50073058
Substrate/Competitorn/a
Meas. Tech.ChEMBL_1468240 (CHEMBL3411783)
Ki 100±n/a nM
Citation Han, SZhang, FFQian, HYChen, LLPu, JBXie, XChen, JZ Design, syntheses, structure-activity relationships and docking studies of coumarin derivatives as novel selective ligands for the CB2 receptor. Eur J Med Chem93:16-32 (2015) 
 
Cannabinoid receptor 2
Name:Cannabinoid receptor 2
Type:G Protein-Coupled Receptor (GPCR)
Mol. Mass.:39690.94
Organism:Homo sapiens (Human)
Description:P34972
Residue:360
BDBM50073058
NameBDBM50073058
Synonyms:CHEMBL3410830
TypeSmall organic molecule
Emp. Form.C24H32N2O6
Mol. Mass.444.5207
SMILESCCCCCOc1c(OC)ccc2cc(C(=O)N3CCCC(C3)C(=O)OCC)c(=O)[nH]c12