Reaction Details
TargetCannabinoid receptor 2
LigandBDBM50073062
Substrate/Competitorn/a
Meas. Tech.ChEMBL_1468240 (CHEMBL3411783)
Ki 4.8±n/a nM
Citation Han, SZhang, FFQian, HYChen, LLPu, JBXie, XChen, JZ Design, syntheses, structure-activity relationships and docking studies of coumarin derivatives as novel selective ligands for the CB2 receptor. Eur J Med Chem93:16-32 (2015) 
 
Cannabinoid receptor 2
Name:Cannabinoid receptor 2
Type:G Protein-Coupled Receptor (GPCR)
Mol. Mass.:39690.94
Organism:Homo sapiens (Human)
Description:P34972
Residue:360
BDBM50073062
NameBDBM50073062
Synonyms:CHEMBL3410833
TypeSmall organic molecule
Emp. Form.C23H29NO4
Mol. Mass.383.4807
SMILESCCCCCOc1cc(\C=C\C(=O)NCCc2ccc(O)cc2)ccc1OC