Reaction Details
TargetCannabinoid receptor 2
LigandBDBM50353092
Substrate/Competitorn/a
Meas. Tech.ChEMBL_1468240 (CHEMBL3411783)
Ki 0.130017±n/a nM
Citation Han, SZhang, FFQian, HYChen, LLPu, JBXie, XChen, JZ Design, syntheses, structure-activity relationships and docking studies of coumarin derivatives as novel selective ligands for the CB2 receptor. Eur J Med Chem93:16-32 (2015) 
 
Cannabinoid receptor 2
Name:Cannabinoid receptor 2
Type:G Protein-Coupled Receptor (GPCR)
Mol. Mass.:39690.94
Organism:Homo sapiens (Human)
Description:P34972
Residue:360
BDBM50353092
NameBDBM50353092
Synonyms:CHEMBL1822945
TypeSmall organic molecule
Emp. Form.C23H27N3O4
Mol. Mass.409.4782
SMILESCCCCCOc1c(OC)ccc2cc(C(=O)NCCc3ccncc3)c(=O)[nH]c12