Reaction Details
TargetCannabinoid receptor 2
LigandBDBM50073001
Substrate/Competitorn/a
Meas. Tech.ChEMBL_1468240 (CHEMBL3411783)
Ki 0.109901±n/a nM
Citation Han, SZhang, FFQian, HYChen, LLPu, JBXie, XChen, JZ Design, syntheses, structure-activity relationships and docking studies of coumarin derivatives as novel selective ligands for the CB2 receptor. Eur J Med Chem93:16-32 (2015) 
 
Cannabinoid receptor 2
Name:Cannabinoid receptor 2
Type:G Protein-Coupled Receptor (GPCR)
Mol. Mass.:39690.94
Organism:Homo sapiens (Human)
Description:P34972
Residue:360
BDBM50073001
NameBDBM50073001
Synonyms:CHEMBL3410827
TypeSmall organic molecule
Emp. Form.C26H36N2O3
Mol. Mass.424.5756
SMILESCCCCCOc1ccc2C(=O)N(CCc3ccc(N)cc3)Cc2c1OCCCCC