Reaction Details
TargetCannabinoid receptor 2
LigandBDBM50380894
Substrate/Competitorn/a
Meas. Tech.ChEMBL_1468240 (CHEMBL3411783)
Ki 6.2±n/a nM
Citation Han, SZhang, FFQian, HYChen, LLPu, JBXie, XChen, JZ Design, syntheses, structure-activity relationships and docking studies of coumarin derivatives as novel selective ligands for the CB2 receptor. Eur J Med Chem93:16-32 (2015) 
 
Cannabinoid receptor 2
Name:Cannabinoid receptor 2
Type:G Protein-Coupled Receptor (GPCR)
Mol. Mass.:39690.94
Organism:Homo sapiens (Human)
Description:P34972
Residue:360
BDBM50380894
NameBDBM50380894
Synonyms:CHEMBL2019078
TypeSmall organic molecule
Emp. Form.C28H42N2O4
Mol. Mass.470.6441
SMILESOC(=O)C1(CCCCCCC1)NC(=O)c1cc2CCCCCCc2n(CC2CCCCC2)c1=O