Reaction Details
TargetCannabinoid receptor 2
LigandBDBM50382743
Substrate/Competitorn/a
Meas. Tech.ChEMBL_1468240 (CHEMBL3411783)
Ki 22±n/a nM
Citation Han, SZhang, FFQian, HYChen, LLPu, JBXie, XChen, JZ Design, syntheses, structure-activity relationships and docking studies of coumarin derivatives as novel selective ligands for the CB2 receptor. Eur J Med Chem93:16-32 (2015) 
 
Cannabinoid receptor 2
Name:Cannabinoid receptor 2
Type:G Protein-Coupled Receptor (GPCR)
Mol. Mass.:39690.94
Organism:Homo sapiens (Human)
Description:P34972
Residue:360
BDBM50382743
NameBDBM50382743
Synonyms:CHEMBL2023581
TypeSmall organic molecule
Emp. Form.C24H31N3O4S
Mol. Mass.457.586
SMILESOC(=O)Cc1csc(NC(=O)c2cc3CCCCCCc3n(CC3CCCCC3)c2=O)n1