Reaction Details
TargetCannabinoid receptor 2
LigandBDBM50073057
Substrate/Competitorn/a
Meas. Tech.ChEMBL_1468240 (CHEMBL3411783)
Ki 2.5±n/a nM
Citation Han, SZhang, FFQian, HYChen, LLPu, JBXie, XChen, JZ Design, syntheses, structure-activity relationships and docking studies of coumarin derivatives as novel selective ligands for the CB2 receptor. Eur J Med Chem93:16-32 (2015) 
 
Cannabinoid receptor 2
Name:Cannabinoid receptor 2
Type:G Protein-Coupled Receptor (GPCR)
Mol. Mass.:39690.94
Organism:Homo sapiens (Human)
Description:P34972
Residue:360
BDBM50073057
NameBDBM50073057
Synonyms:CHEMBL3410829
TypeSmall organic molecule
Emp. Form.C21H27NO4
Mol. Mass.357.4434
SMILESCCCCCOc1cc(ccc1OC)C(=O)NCCc1ccc(O)cc1