Reaction Details
TargetCannabinoid receptor 2
LigandBDBM50073063
Substrate/Competitorn/a
Meas. Tech.ChEMBL_1468240 (CHEMBL3411783)
Ki 11±n/a nM
Citation Han, SZhang, FFQian, HYChen, LLPu, JBXie, XChen, JZ Design, syntheses, structure-activity relationships and docking studies of coumarin derivatives as novel selective ligands for the CB2 receptor. Eur J Med Chem93:16-32 (2015) 
 
Cannabinoid receptor 2
Name:Cannabinoid receptor 2
Type:G Protein-Coupled Receptor (GPCR)
Mol. Mass.:39690.94
Organism:Homo sapiens (Human)
Description:P34972
Residue:360
BDBM50073063
NameBDBM50073063
Synonyms:CHEMBL3410834
TypeSmall organic molecule
Emp. Form.C22H27NO4
Mol. Mass.369.4541
SMILESCCCCCOc1c2CN(CCc3ccc(O)cc3)C(=O)c2ccc1OC