Reaction Details
TargetCannabinoid receptor 1
LigandBDBM50073071
Substrate/Competitorn/a
Meas. Tech.ChEMBL_1468239 (CHEMBL3411782)
IC50>10000±n/a nM
Citation Han, SZhang, FFQian, HYChen, LLPu, JBXie, XChen, JZ Design, syntheses, structure-activity relationships and docking studies of coumarin derivatives as novel selective ligands for the CB2 receptor. Eur J Med Chem93:16-32 (2015) 
 
Cannabinoid receptor 1
Name:Cannabinoid receptor 1
Type:G Protein-Coupled Receptor (GPCR)
Mol. Mass.:52868.96
Organism:Homo sapiens (Human)
Description:P21554
Residue:472
BDBM50073071
NameBDBM50073071
Synonyms:CHEMBL3410715
TypeSmall organic molecule
Emp. Form.C20H24BrNO4
Mol. Mass.422.313
SMILESCCCCOc1cc(Br)cc2cc(C(=O)NC3CCCCC3)c(=O)oc12