Reaction Details
TargetAndrogen receptor
LigandBDBM8885
Substrate/Competitorn/a
Meas. Tech.ChEMBL_1468250 (CHEMBL3411793)
IC50 4.2±n/a nM
Citation Sundén, HHolland, MCPoutiainen, PKJääskeläinen, TPulkkinen, JTPalvimo, JJOlsson, R Synthesis and biological evaluation of second-generation tropanol-based androgen receptor modulators. J Med Chem58:1569-74 (2015) 
 
Androgen receptor
Name:Androgen receptor
Type:Receptor
Mol. Mass.:99185.27
Organism:Homo sapiens (Human)
Description:CHO cells were stably transfected with human AR gene.
Residue:920
BDBM8885
NameBDBM8885
Synonyms:(1S,2R,10R,11S,14S,15S)-14-hydroxy-2,15-dimethyltetracyclo[8.7.0.0^{2,7}.0^{11,15}]heptadec-6-en-5-one Testosterone US9682960, Testosterone
TypeSteroid
Emp. Form.C19H28O2
Mol. Mass.288.4244
SMILES[H][C@@]12CC[C@H](O)[C@@]1(C)CC[C@@]1([H])[C@@]2([H])CCC2=CC(=O)CC[C@]12C