Reaction Details
TargetTransient receptor potential cation channel subfamily V member 1
LigandBDBM50073149
Substrate/Competitorn/a
Meas. Tech.ChEMBL_1468885 (CHEMBL3412242)
Ki 1.000000±n/a nM
Citation Ryu, HSeo, SLee, JYHa, THLee, SJung, AAnn, JKim, SEYoon, SHong, MBlumberg, PMFrank-Foltyn, RBahrenberg, GSchiene, KStockhausen, HChristoph, TFrormann, SLee, J Pyridine C-region analogs of 2-(3-fluoro-4-methylsulfonylaminophenyl)propanamides as potent TRPV1 antagonists. Eur J Med Chem93:101-8 (2015) 
 
Transient receptor potential cation channel subfamily V member 1
Name:Transient receptor potential cation channel subfamily V member 1
Type:Protein
Mol. Mass.:94960.75
Organism:Homo sapiens (Human)
Description:Q8NER1
Residue:839
BDBM50073149
NameBDBM50073149
Synonyms:CHEMBL3407759
TypeSmall organic molecule
Emp. Form.C24H30ClF3N4O3S
Mol. Mass.547.033
SMILESCC(C(=O)NCc1ccc(nc1N1CC(C)CC(C)C1)C(F)(F)Cl)c1ccc(NS(C)(=O)=O)c(F)c1