Reaction Details
TargetTransient receptor potential cation channel subfamily V member 1
LigandBDBM50073152
Substrate/Competitorn/a
Meas. Tech.ChEMBL_1468885 (CHEMBL3412242)
Ki 1.1±n/a nM
Citation Ryu, HSeo, SLee, JYHa, THLee, SJung, AAnn, JKim, SEYoon, SHong, MBlumberg, PMFrank-Foltyn, RBahrenberg, GSchiene, KStockhausen, HChristoph, TFrormann, SLee, J Pyridine C-region analogs of 2-(3-fluoro-4-methylsulfonylaminophenyl)propanamides as potent TRPV1 antagonists. Eur J Med Chem93:101-8 (2015) 
 
Transient receptor potential cation channel subfamily V member 1
Name:Transient receptor potential cation channel subfamily V member 1
Type:Protein
Mol. Mass.:94960.75
Organism:Homo sapiens (Human)
Description:Q8NER1
Residue:839
BDBM50073152
NameBDBM50073152
Synonyms:CHEMBL3407757
TypeSmall organic molecule
Emp. Form.C24H31FN4O3S
Mol. Mass.474.591
SMILESCC(C(=O)NCc1ccc(nc1N1CCCCC1)C1CC1)c1ccc(NS(C)(=O)=O)c(F)c1