Reaction Details
TargetTransient receptor potential cation channel subfamily V member 1
LigandBDBM50073177
Substrate/Competitorn/a
Meas. Tech.ChEMBL_1468885 (CHEMBL3412242)
Ki 0.800000±n/a nM
Citation Ryu, HSeo, SLee, JYHa, THLee, SJung, AAnn, JKim, SEYoon, SHong, MBlumberg, PMFrank-Foltyn, RBahrenberg, GSchiene, KStockhausen, HChristoph, TFrormann, SLee, J Pyridine C-region analogs of 2-(3-fluoro-4-methylsulfonylaminophenyl)propanamides as potent TRPV1 antagonists. Eur J Med Chem93:101-8 (2015) 
 
Transient receptor potential cation channel subfamily V member 1
Name:Transient receptor potential cation channel subfamily V member 1
Type:Protein
Mol. Mass.:94960.75
Organism:Homo sapiens (Human)
Description:Q8NER1
Residue:839
BDBM50073177
NameBDBM50073177
Synonyms:CHEMBL3407763
TypeSmall organic molecule
Emp. Form.C23H29ClF3N3O4S
Mol. Mass.536.007
SMILESCCCCCCOc1nc(ccc1CNC(=O)C(C)c1ccc(NS(C)(=O)=O)c(F)c1)C(F)(F)Cl