Reaction Details
TargetPotassium voltage-gated channel subfamily H member 2
LigandBDBM50073187
Substrate/Competitorn/a
Meas. Tech.ChEMBL_1469088 (CHEMBL3413194)
IC50>10000±n/a nM
Citation Mallinger, ACrumpler, SPichowicz, MWaalboer, DStubbs, MAdeniji-Popoola, OWood, BSmith, EThai, CHenley, ATGeorgi, KCourt, WHobbs, SBox, GOrtiz-Ruiz, MJValenti, MDe Haven Brandon, ATePoele, RLeuthner, BWorkman, PAherne, WPoeschke, ODale, TWienke, DEsdar, CRohdich, FRaynaud, FClarke, PAEccles, SAStieber, FSchiemann, KBlagg, J Discovery of potent, orally bioavailable, small-molecule inhibitors of WNT signaling from a cell-based pathway screen. J Med Chem58:1717-35 (2015) 
 
Potassium voltage-gated channel subfamily H member 2
Name:Potassium voltage-gated channel subfamily H member 2
Type:Multi-pass membrane protein
Mol. Mass.:126672.65
Organism:Homo sapiens (Human)
Description:Q12809
Residue:1159
BDBM50073187
NameBDBM50073187
Synonyms:CHEMBL1673059
TypeSmall organic molecule
Emp. Form.C11H13Cl2N3O
Mol. Mass.274.146
SMILESNC(=O)C1CCN(CC1)c1c(Cl)cncc1Cl