Reaction Details
TargetKallikrein-7
LigandBDBM50073222
Substrate/Competitorn/a
Meas. Tech.ChEMBL_1469259 (CHEMBL3413940)
Ki 50600±n/a nM
Citation Arama, DPSoualmia, FLisowski, VLongevial, JFBosc, EMaillard, LTMartinez, JMasurier, NEl Amri, C Pyrido-imidazodiazepinones as a new class of reversible inhibitors of human kallikrein 7. Eur J Med Chem93:202-13 (2015) 
 
Kallikrein-7
Name:Kallikrein-7
Type:PROTEIN
Mol. Mass.:27535.05
Organism:Homo sapiens (Human)
Description:ChEMBL_1469257
Residue:253
BDBM50073222
NameBDBM50073222
Synonyms:CHEMBL3125572
TypeSmall organic molecule
Emp. Form.C24H20N4O
Mol. Mass.380.4418
SMILESCc1ccccc1C1=Nc2nc3ccccn3c2C(=O)[C@H](Cc2ccccc2)N1