Reaction Details
TargetSerine/threonine-protein kinase PLK4
LigandBDBM50073547
Substrate/Competitorn/a
Meas. Tech.ChEMBL_1467184 (CHEMBL3411381)
IC50 1.5±n/a nM
Citation Sampson, PBLiu, YForrest, BCumming, GLi, SWPatel, NKEdwards, LLaufer, RFeher, MBan, FAwrey, DEMao, GPlotnikova, OHodgson, RBeletskaya, IMason, JMLuo, XNadeem, VWei, XKiarash, RMadeira, BHuang, PMak, TWPan, GPauls, HW The discovery of Polo-like kinase 4 inhibitors: identification of (1R,2S).2-(3-((E).4-(((cis).2,6-dimethylmorpholino)methyl)styryl). 1H.indazol-6-yl)-5'-methoxyspiro[cyclopropane-1,3'-indolin]-2'-one (CFI-400945) as a potent, orally active antitumor agent. J Med Chem58:147-69 (2015) 
 
Serine/threonine-protein kinase PLK4
Name:Serine/threonine-protein kinase PLK4
Type:PROTEIN
Mol. Mass.:108996.91
Organism:Homo sapiens (Human)
Description:ChEMBL_1474078
Residue:970
BDBM50073547
NameBDBM50073547
Synonyms:CHEMBL3408951
TypeSmall organic molecule
Emp. Form.C33H34N4O3
Mol. Mass.534.6481
SMILESCOc1ccc2N(C)C(=O)[C@@]3(C[C@H]3c3ccc4c(\C=C\c5ccc(cc5)[C@H](C)N5CCOCC5)n[nH]c4c3)c2c1