Reaction Details
TargetCytochrome P450 2C19
LigandBDBM50073554
Substrate/Competitorn/a
Meas. Tech.ChEMBL_1467193 (CHEMBL3411390)
IC50 1200±n/a nM
Citation Sampson, PBLiu, YForrest, BCumming, GLi, SWPatel, NKEdwards, LLaufer, RFeher, MBan, FAwrey, DEMao, GPlotnikova, OHodgson, RBeletskaya, IMason, JMLuo, XNadeem, VWei, XKiarash, RMadeira, BHuang, PMak, TWPan, GPauls, HW The discovery of Polo-like kinase 4 inhibitors: identification of (1R,2S).2-(3-((E).4-(((cis).2,6-dimethylmorpholino)methyl)styryl). 1H.indazol-6-yl)-5'-methoxyspiro[cyclopropane-1,3'-indolin]-2'-one (CFI-400945) as a potent, orally active antitumor agent. J Med Chem58:147-69 (2015) 
 
Cytochrome P450 2C19
Name:Cytochrome P450 2C19
Type:Enzyme
Mol. Mass.:55935.47
Organism:Homo sapiens (Human)
Description:P33261
Residue:490
BDBM50073554
NameBDBM50073554
Synonyms:CHEMBL3408940 US9907800, Example A110
TypeSmall organic molecule
Emp. Form.C30H30N6O
Mol. Mass.490.5988
SMILESCN1C(=O)[C@@]2(C[C@H]2c2ccc3c(\C=C\c4ccc(nc4)N4CCN(C)CC4)n[nH]c3c2)c2ccccc12