Reaction Details
TargetAurora kinase A
LigandBDBM50073587
Substrate/Competitorn/a
Meas. Tech.ChEMBL_1467394 (CHEMBL3411678)
EC50 510±n/a nM
Citation Sampson, PBLiu, YForrest, BCumming, GLi, SWPatel, NKEdwards, LLaufer, RFeher, MBan, FAwrey, DEMao, GPlotnikova, OHodgson, RBeletskaya, IMason, JMLuo, XNadeem, VWei, XKiarash, RMadeira, BHuang, PMak, TWPan, GPauls, HW The discovery of Polo-like kinase 4 inhibitors: identification of (1R,2S).2-(3-((E).4-(((cis).2,6-dimethylmorpholino)methyl)styryl). 1H.indazol-6-yl)-5'-methoxyspiro[cyclopropane-1,3'-indolin]-2'-one (CFI-400945) as a potent, orally active antitumor agent. J Med Chem58:147-69 (2015) 
 
Aurora kinase A
Name:Aurora kinase A
Type:Serine/threonine-protein kinase
Mol. Mass.:45830.98
Organism:Homo sapiens (Human)
Description:O14965
Residue:403
BDBM50073587
NameBDBM50073587
Synonyms:CHEMBL3408947 US20230365537, Example CFI-400495 | US9907800, Example A185
TypeSmall organic molecule
Emp. Form.C33H34N4O3
Mol. Mass.534.6481
SMILESCOc1ccc2NC(=O)[C@@]3(C[C@H]3c3ccc4c(\C=C\c5ccc(CN6C[C@H](C)O[C@H](C)C6)cc5)n[nH]c4c3)c2c1