Reaction Details
TargetTranslocator protein
LigandBDBM50073598
Substrate/Competitorn/a
Meas. Tech.ChEMBL_1467416 (CHEMBL3411700)
Ki 0.770000±n/a nM
Citation Banister, SDBeinat, CWilkinson, SMShen, BBartoli, CSelleri, SDa Pozzo, EMartini, CChin, FTKassiou, M Ether analogues of DPA-714 with subnanomolar affinity for the translocator protein (TSPO). Eur J Med Chem93:392-400 (2015) 
 
Translocator protein
Name:Translocator protein
Type:Mitochondrion membrane protein
Mol. Mass.:18945.84
Organism:Rattus norvegicus (rat)
Description:Competitive binding experiments were performed on rat kidney mitochondrial membranes.
Residue:169
BDBM50073598
NameBDBM50073598
Synonyms:CHEMBL3408969
TypeSmall organic molecule
Emp. Form.C27H29FN4O2
Mol. Mass.460.5432
SMILESCCN(CC)C(=O)Cc1c(nn2c(C)cc(C)nc12)-c1ccc(OCc2ccc(F)cc2)cc1