Reaction Details
TargetTranslocator protein
LigandBDBM50073600
Substrate/Competitorn/a
Meas. Tech.ChEMBL_1467416 (CHEMBL3411700)
Ki 0.670000±n/a nM
Citation Banister, SDBeinat, CWilkinson, SMShen, BBartoli, CSelleri, SDa Pozzo, EMartini, CChin, FTKassiou, M Ether analogues of DPA-714 with subnanomolar affinity for the translocator protein (TSPO). Eur J Med Chem93:392-400 (2015) 
 
Translocator protein
Name:Translocator protein
Type:Mitochondrion membrane protein
Mol. Mass.:18945.84
Organism:Rattus norvegicus (rat)
Description:Competitive binding experiments were performed on rat kidney mitochondrial membranes.
Residue:169
BDBM50073600
NameBDBM50073600
Synonyms:CHEMBL3408971
TypeSmall organic molecule
Emp. Form.C28H29F3N4O2
Mol. Mass.510.5507
SMILESCCN(CC)C(=O)Cc1c(nn2c(C)cc(C)nc12)-c1ccc(OCc2cccc(c2)C(F)(F)F)cc1