Reaction Details
TargetTranslocator protein
LigandBDBM50073602
Substrate/Competitorn/a
Meas. Tech.ChEMBL_1467416 (CHEMBL3411700)
Ki 0.130000±n/a nM
Citation Banister, SDBeinat, CWilkinson, SMShen, BBartoli, CSelleri, SDa Pozzo, EMartini, CChin, FTKassiou, M Ether analogues of DPA-714 with subnanomolar affinity for the translocator protein (TSPO). Eur J Med Chem93:392-400 (2015) 
 
Translocator protein
Name:Translocator protein
Type:Mitochondrion membrane protein
Mol. Mass.:18945.84
Organism:Rattus norvegicus (rat)
Description:Competitive binding experiments were performed on rat kidney mitochondrial membranes.
Residue:169
BDBM50073602
NameBDBM50073602
Synonyms:CHEMBL3408973
TypeSmall organic molecule
Emp. Form.C28H32N4O2
Mol. Mass.456.5793
SMILESCCN(CC)C(=O)Cc1c(nn2c(C)cc(C)nc12)-c1ccc(OCCc2ccccc2)cc1