Reaction Details
TargetLeucine-rich repeat serine/threonine-protein kinase 2
LigandBDBM482157
Substrate/Competitorn/a
Meas. Tech.ChEMBL_1467831 (CHEMBL3412556)
IC50 7.9±n/a nM
Citation Munoz, LKavanagh, MEPhoa, AFHeng, BDzamko, NChen, EJDoddareddy, MRGuillemin, GJKassiou, M Optimisation of LRRK2 inhibitors and assessment of functional efficacy in cell-based models of neuroinflammation. Eur J Med Chem95:29-34 (2015) 
 
Leucine-rich repeat serine/threonine-protein kinase 2
Name:Leucine-rich repeat serine/threonine-protein kinase 2
Type:Protein
Mol. Mass.:286113.20
Organism:Homo sapiens (Human)
Description:Q5S007
Residue:2527
BDBM482157
NameBDBM482157
Synonyms:BDBM50379529 US11370796, Compound LRRK2-IN-1
Typen/a
Emp. Form.C31H38N8O3
Mol. Mass.570.6852
SMILESCOc1cc(ccc1Nc1ncc2N(C)C(=O)c3ccccc3N(C)c2n1)C(=O)N1CCC(CC1)N1CCN(C)CC1