Reaction Details
TargetLeucine-rich repeat serine/threonine-protein kinase 2
LigandBDBM50073938
Substrate/Competitorn/a
Meas. Tech.ChEMBL_1467831 (CHEMBL3412556)
IC50>1000±n/a nM
Citation Munoz, LKavanagh, MEPhoa, AFHeng, BDzamko, NChen, EJDoddareddy, MRGuillemin, GJKassiou, M Optimisation of LRRK2 inhibitors and assessment of functional efficacy in cell-based models of neuroinflammation. Eur J Med Chem95:29-34 (2015) 
 
Leucine-rich repeat serine/threonine-protein kinase 2
Name:Leucine-rich repeat serine/threonine-protein kinase 2
Type:Protein
Mol. Mass.:286113.20
Organism:Homo sapiens (Human)
Description:Q5S007
Residue:2527
BDBM50073938
NameBDBM50073938
Synonyms:CHEMBL3409479
TypeSmall organic molecule
Emp. Form.C23H34ClN3O
Mol. Mass.403.989
SMILESClc1cc(ccc1NC1CCCCC1)C(=O)N1CCC(CC1)N1CCCCC1