Reaction Details
TargetEpidermal growth factor receptor
LigandBDBM50073942
Substrate/Competitorn/a
Meas. Tech.ChEMBL_1467840 (CHEMBL3412565)
IC50 23±n/a nM
Citation Buron, FMérour, JYAkssira, MGuillaumet, GRoutier, S Recent advances in the chemistry and biology of pyridopyrimidines. Eur J Med Chem95:76-95 (2015) 
 
Epidermal growth factor receptor
Name:Epidermal growth factor receptor
Type:Receptor Kinase Domain
Mol. Mass.:134279.59
Organism:Homo sapiens (Human)
Description:P00533
Residue:1210
BDBM50073942
NameBDBM50073942
Synonyms:CHEMBL3409483
TypeSmall organic molecule
Emp. Form.C29H26FN5O3S
Mol. Mass.543.612
SMILES[O-][S+]1CCN(Cc2ccc(o2)-c2cc3c(Nc4ccc(OCc5cccc(F)c5)cc4)ncnc3cn2)CC1