Reaction Details
TargetReceptor tyrosine-protein kinase erbB-2
LigandBDBM50099963
Substrate/Competitorn/a
Meas. Tech.ChEMBL_1467839 (CHEMBL3412564)
IC50 16±n/a nM
Citation Buron, FMérour, JYAkssira, MGuillaumet, GRoutier, S Recent advances in the chemistry and biology of pyridopyrimidines. Eur J Med Chem95:76-95 (2015) 
 
Receptor tyrosine-protein kinase erbB-2
Name:Receptor tyrosine-protein kinase erbB-2
Type:n/a
Mol. Mass.:137894.47
Organism:Homo sapiens (Human)
Description:P04626
Residue:1255
BDBM50099963
NameBDBM50099963
Synonyms:CHEMBL30432 | N*4*-(1-Benzyl-1H-indazol-5-yl)-N*6*,N*6*-dimethyl-pyrido[3,4-d]pyrimidine-4,6-diamine
TypeSmall organic molecule
Emp. Form.C23H21N7
Mol. Mass.395.4597
SMILESCN(C)c1cc2c(Nc3ccc4n(Cc5ccccc5)ncc4c3)ncnc2cn1