Reaction Details
TargetOligo-1,6-glucosidase IMA1
LigandBDBM50018905
Substrate/Competitorn/a
Meas. Tech.ChEMBL_1467867 (CHEMBL3412764)
IC50 35000±n/a nM
Citation Niaz, HKashtoh, HKhan, JAKhan, AWahab, ATAlam, MTKhan, KMPerveen, SChoudhary, MI Synthesis of diethyl 4-substituted-2,6-dimethyl-1,4-dihydropyridine-3,5-dicarboxylates as a new series of inhibitors against yeasta-glucosidase. Eur J Med Chem95:199-209 (2015) 
 
Oligo-1,6-glucosidase IMA1
Name:Oligo-1,6-glucosidase IMA1
Type:Protein
Mol. Mass.:68577.59
Organism:Saccharomyces cerevisiae S288c (Baker's yeast)
Description:n/a
Residue:589
BDBM50018905
NameBDBM50018905
Synonyms:2,6-Dimethyl-4-(3-nitro-phenyl)-1,4-dihydro-pyridine-3,5-dicarboxylic acid diethyl ester diethyl 2,6-dimethyl-4-(3-nitrophenyl)-1,4-dihydro-3,5-pyridinedicarboxylate
TypeSmall organic molecule
Emp. Form.C19H22N2O6
Mol. Mass.374.3878
SMILESCCOC([O-])=C1C(C(C(=[OH+])OCC)=C(C)N=C1C)c1cccc(c1)[N+]([O-])=O