Reaction Details
TargetOligo-1,6-glucosidase IMA1
LigandBDBM50074020
Substrate/Competitorn/a
Meas. Tech.ChEMBL_1467868 (CHEMBL3412765)
Ki 68000±n/a nM
Citation Niaz, HKashtoh, HKhan, JAKhan, AWahab, ATAlam, MTKhan, KMPerveen, SChoudhary, MI Synthesis of diethyl 4-substituted-2,6-dimethyl-1,4-dihydropyridine-3,5-dicarboxylates as a new series of inhibitors against yeasta-glucosidase. Eur J Med Chem95:199-209 (2015) 
 
Oligo-1,6-glucosidase IMA1
Name:Oligo-1,6-glucosidase IMA1
Type:Protein
Mol. Mass.:68577.59
Organism:Saccharomyces cerevisiae S288c (Baker's yeast)
Description:n/a
Residue:589
BDBM50074020
NameBDBM50074020
Synonyms:CHEMBL1099206
TypeSmall organic molecule
Emp. Form.C19H22N2O6
Mol. Mass.374.3878
SMILESCCOC(=O)C1=C(C)NC(C)=C(C1c1ccc(cc1)[N+]([O-])=O)C(=O)OCC