Reaction Details
TargetOrexin receptor type 2
LigandBDBM50074053
Substrate/Competitorn/a
Meas. Tech.ChEMBL_1468058 (CHEMBL3413696)
IC50 3.0±n/a nM
Citation Sifferlen, TBoller, AChardonneau, ACottreel, EGatfield, JTreiber, ARoch, CJenck, FAissaoui, HWilliams, JTBrotschi, CHeidmann, BSiegrist, RBoss, C Substituted pyrrolidin-2-ones: Centrally acting orexin receptor antagonists promoting sleep. Part 2. Bioorg Med Chem Lett25:1884-91 (2015) 
 
Orexin receptor type 2
Name:Orexin receptor type 2
Type:Protein
Mol. Mass.:50710.53
Organism:Homo sapiens (Human)
Description:O43614
Residue:444
BDBM50074053
NameBDBM50074053
Synonyms:CHEMBL3409876
TypeSmall organic molecule
Emp. Form.C24H20FNO4
Mol. Mass.405.4183
SMILESCOc1cccc(F)c1[C@@H]1C[C@@H](O)C(=O)N1Cc1ccc2oc3ccccc3c2c1