Reaction Details
TargetProthrombin
LigandBDBM50249298
Substrate/Competitorn/a
Meas. Tech.ChEMBL_1468091 (CHEMBL3413864)
IC50 18000±n/a nM
Citation Xing, JYang, LLi, HLi, QZhao, LWang, XZhang, YZhou, MZhou, JZhang, H Identification of anthranilamide derivatives as potential factor Xa inhibitors: drug design, synthesis and biological evaluation. Eur J Med Chem95:388-99 (2015) 
 
Prothrombin
Name:Prothrombin
Type:Protein
Mol. Mass.:70029.57
Organism:Homo sapiens (Human)
Description:P00734
Residue:622
BDBM50249298
NameBDBM50249298
Synonyms:BEVYXXA N-(5-chloropyridin-2-yl)-2-(4-(N,N-dimethylcarbamimidoyl)benzamido)-5-methoxybenzamide | betrixaban
TypeSmall organic molecule
Emp. Form.C23H22ClN5O3
Mol. Mass.451.905
SMILESCOc1ccc(NC(=O)c2ccc(cc2)C(=N)N(C)C)c(c1)C(=O)Nc1ccc(Cl)cn1