Reaction Details
TargetFalcipain 2
LigandBDBM50074131
Substrate/Competitorn/a
Meas. Tech.ChEMBL_1468093 (CHEMBL3413866)
Ki 800±n/a nM
Citation Chakka, SKKalamuddin, MSundararaman, SWei, LMundra, SMahesh, RMalhotra, PMohmmed, AKotra, LP Identification of novel class of falcipain-2 inhibitors as potential antimalarial agents. Bioorg Med Chem23:2221-40 (2015) 
 
Falcipain 2
Name:Falcipain 2
Type:Enzyme
Mol. Mass.:55912.60
Organism:Plasmodium falciparum
Description:Recombinant falcipain-2.
Residue:484
BDBM50074131
NameBDBM50074131
Synonyms:CHEMBL3409914
TypeSmall organic molecule
Emp. Form.C33H48N6O4
Mol. Mass.592.772
SMILESCC(C)C[C@H](NC(=O)[C@H](CC(C)C)NC(=O)N1CCCCC1)C(=O)N[C@@H](Cc1ccccc1)C(=O)NNc1ccccc1