Reaction Details
TargetFalcipain 2
LigandBDBM50074138
Substrate/Competitorn/a
Meas. Tech.ChEMBL_1468093 (CHEMBL3413866)
Ki 1100±n/a nM
Citation Chakka, SKKalamuddin, MSundararaman, SWei, LMundra, SMahesh, RMalhotra, PMohmmed, AKotra, LP Identification of novel class of falcipain-2 inhibitors as potential antimalarial agents. Bioorg Med Chem23:2221-40 (2015) 
 
Falcipain 2
Name:Falcipain 2
Type:Enzyme
Mol. Mass.:55912.60
Organism:Plasmodium falciparum
Description:Recombinant falcipain-2.
Residue:484
BDBM50074138
NameBDBM50074138
Synonyms:CHEMBL3409907
TypeSmall organic molecule
Emp. Form.C36H50FN5O6
Mol. Mass.667.8105
SMILESCC(C)C[C@H](NC(=O)[C@H](CC(C)C)NC(=O)N1CCOCC1)C(=O)N[C@H](C(=O)N1CCC[C@H]1COc1ccc(F)cc1)c1ccccc1