Reaction Details
TargetFalcipain 2
LigandBDBM50074139
Substrate/Competitorn/a
Meas. Tech.ChEMBL_1468093 (CHEMBL3413866)
Ki 4600±n/a nM
Citation Chakka, SKKalamuddin, MSundararaman, SWei, LMundra, SMahesh, RMalhotra, PMohmmed, AKotra, LP Identification of novel class of falcipain-2 inhibitors as potential antimalarial agents. Bioorg Med Chem23:2221-40 (2015) 
 
Falcipain 2
Name:Falcipain 2
Type:Enzyme
Mol. Mass.:55912.60
Organism:Plasmodium falciparum
Description:Recombinant falcipain-2.
Residue:484
BDBM50074139
NameBDBM50074139
Synonyms:CHEMBL3409906
TypeSmall organic molecule
Emp. Form.C43H59FN6O7
Mol. Mass.790.963
SMILESCOC(=O)C1CCN(CC(=O)N[C@@H](CC(C)C)C(=O)N[C@@H](CC(C)C)C(=O)N[C@@H](Cc2c[nH]c3ccccc23)C(=O)N2CCC[C@H]2COc2ccc(F)cc2)CC1