Reaction Details
TargetNeurogenic locus notch homolog protein 3
LigandBDBM50074784
Substrate/Competitorn/a
Meas. Tech.ChEMBL_1468308 (CHEMBL3412051)
IC50 3.0±n/a nM
Citation Shan, WBalog, AQuesnelle, CGill, PHan, WCNorris, DMandal, SThiruvenkadam, RGona, KBThiyagarajan, KKandula, SMcGlinchey, KMenard, KWen, MLRose, AWhite, RGuarino, VShen, DRCvijic, MERanasinghe, ADai, JZhang, YWu, DRMathur, ARampulla, RTrainor, GHunt, JTVite, GDWesthouse, RLee, FYGavai, AV BMS-871: a novel orally active pan-Notch inhibitor as an anticancer agent. Bioorg Med Chem Lett25:1905-9 (2015) 
 
Neurogenic locus notch homolog protein 3
Name:Neurogenic locus notch homolog protein 3
Type:Enzyyme
Mol. Mass.:243579.59
Organism:Homo sapiens (Human)
Description:Q9UM47
Residue:2321
BDBM50074784
NameBDBM50074784
Synonyms:CHEMBL3410151
TypeSmall organic molecule
Emp. Form.C29H38N4O3
Mol. Mass.490.637
SMILESCCC(CC)[C@@H]([C@@H](CC(C)C)C(=O)N[C@H]1N=C(c2ccccc2)c2ccccc2N(C)C1=O)C(N)=O