Reaction Details
TargetNeurogenic locus notch homolog protein 1
LigandBDBM50074693
Substrate/Competitorn/a
Meas. Tech.ChEMBL_1468307 (CHEMBL3412050)
IC50 3.0±n/a nM
Citation Shan, WBalog, AQuesnelle, CGill, PHan, WCNorris, DMandal, SThiruvenkadam, RGona, KBThiyagarajan, KKandula, SMcGlinchey, KMenard, KWen, MLRose, AWhite, RGuarino, VShen, DRCvijic, MERanasinghe, ADai, JZhang, YWu, DRMathur, ARampulla, RTrainor, GHunt, JTVite, GDWesthouse, RLee, FYGavai, AV BMS-871: a novel orally active pan-Notch inhibitor as an anticancer agent. Bioorg Med Chem Lett25:1905-9 (2015) 
 
Neurogenic locus notch homolog protein 1
Name:Neurogenic locus notch homolog protein 1
Type:Enzyme
Mol. Mass.:272417.95
Organism:Homo sapiens (Human)
Description:P46531
Residue:2555
BDBM50074693
NameBDBM50074693
Synonyms:CHEMBL3410162
TypeSmall organic molecule
Emp. Form.C30H29F3N4O3
Mol. Mass.550.5715
SMILESCN1c2ccccc2C(=N[C@H](NC(=O)[C@H](CCC(F)(F)F)[C@@H](C(N)=O)c2cccc(C)c2)C1=O)c1ccccc1