Reaction Details
TargetNeurogenic locus notch homolog protein 3
LigandBDBM50074799
Substrate/Competitorn/a
Meas. Tech.ChEMBL_1468308 (CHEMBL3412051)
IC50 1.000000±n/a nM
Citation Shan, WBalog, AQuesnelle, CGill, PHan, WCNorris, DMandal, SThiruvenkadam, RGona, KBThiyagarajan, KKandula, SMcGlinchey, KMenard, KWen, MLRose, AWhite, RGuarino, VShen, DRCvijic, MERanasinghe, ADai, JZhang, YWu, DRMathur, ARampulla, RTrainor, GHunt, JTVite, GDWesthouse, RLee, FYGavai, AV BMS-871: a novel orally active pan-Notch inhibitor as an anticancer agent. Bioorg Med Chem Lett25:1905-9 (2015) 
 
Neurogenic locus notch homolog protein 3
Name:Neurogenic locus notch homolog protein 3
Type:Enzyyme
Mol. Mass.:243579.59
Organism:Homo sapiens (Human)
Description:Q9UM47
Residue:2321
BDBM50074799
NameBDBM50074799
Synonyms:CHEMBL3410167
TypeSmall organic molecule
Emp. Form.C29H26F4N4O3
Mol. Mass.554.5354
SMILESCN1c2ccccc2C(=N[C@H](NC(=O)[C@H](CCC(F)(F)F)[C@@H](C(N)=O)c2ccc(F)cc2)C1=O)c1ccccc1