Reaction Details
TargetAldo-keto reductase family 1 member B1
LigandBDBM17636
Substrate/Competitorn/a
Meas. Tech.ChEMBL_1473106 (CHEMBL3421435)
IC50 41000±n/a nM
Citation Maccari, ROttaną, R Targeting aldose reductase for the treatment of diabetes complications and inflammatory diseases: new insights and future directions. J Med Chem58:2047-67 (2015) 
 
Aldo-keto reductase family 1 member B1
Name:Aldo-keto reductase family 1 member B1
Type:Protein
Mol. Mass.:35855.50
Organism:Homo sapiens (Human)
Description:P15121. 4LAU; 2IKI; 4LB4; 2FZD; 2FZ8; 1US0
Residue:316
BDBM17636
NameBDBM17636
Synonyms:2-{[3-(trifluoromethyl)phenyl]amino}benzoic acid CHEMBL23588 Nichisedan US9271961, Flufenamic Acid
TypeSmall organic molecule
Emp. Form.C14H10F3NO2
Mol. Mass.281.2299
SMILESOC(=O)c1ccccc1Nc1cccc(c1)C(F)(F)F