Reaction Details
TargetProtein arginine N-methyltransferase 1 [11-371]
LigandBDBM50075097
Substrate/Competitorn/a
Meas. Tech.ChEMBL_1473678 (CHEMBL3421464)
IC50 4200±n/a nM
Citation Kaniskan, HÜKonze, KDJin, J Selective inhibitors of protein methyltransferases. J Med Chem58:1596-629 (2015) 
 
Protein arginine N-methyltransferase 1 [11-371]
Name:Protein arginine N-methyltransferase 1 [11-371]
Type:Protein
Mol. Mass.:41506.52
Organism:Homo sapiens (Human)
Description:Q99873[11-371]
Residue:361
BDBM50075097
NameBDBM50075097
Synonyms:CHEMBL3414627
TypeSmall organic molecule
Emp. Form.C20H13Cl2N6NaO5S
Mol. Mass.543.315
SMILES[Na+].COc1ccc(cc1)\N=N\c1c(O)c2ccc(Nc3nc(Cl)nc(Cl)n3)cc2cc1S([O-])(=O)=O