Reaction Details
TargetHistone-arginine methyltransferase CARM1
LigandBDBM50396981
Substrate/Competitorn/a
Meas. Tech.ChEMBL_1473652 (CHEMBL3421221)
Ki>20000±n/a nM
Citation Kaniskan, HÜKonze, KDJin, J Selective inhibitors of protein methyltransferases. J Med Chem58:1596-629 (2015) 
 
Histone-arginine methyltransferase CARM1
Name:Histone-arginine methyltransferase CARM1
Type:Protein
Mol. Mass.:65855.47
Organism:Homo sapiens (Human)
Description:Q86X55
Residue:608
BDBM50396981
NameBDBM50396981
Synonyms:CHEMBL2171174
TypeSmall organic molecule
Emp. Form.C15H22N6O5S
Mol. Mass.398.437
SMILESCNc1ncnc2n(cnc12)[C@@H]1O[C@H](CSCC[C@H](N)C(O)=O)[C@@H](O)[C@H]1O