Reaction Details
TargetHistone-lysine N-methyltransferase, H3 lysine-79 specific
LigandBDBM50443025
Substrate/Competitorn/a
Meas. Tech.ChEMBL_1473646 (CHEMBL3421215)
IC50 38±n/a nM
Citation Kaniskan, HÜKonze, KDJin, J Selective inhibitors of protein methyltransferases. J Med Chem58:1596-629 (2015) 
 
Histone-lysine N-methyltransferase, H3 lysine-79 specific
Name:Histone-lysine N-methyltransferase, H3 lysine-79 specific
Type:Protein
Mol. Mass.:184911.91
Organism:Homo sapiens (Human)
Description:Q8TEK3
Residue:1537
BDBM50443025
NameBDBM50443025
Synonyms:CHEMBL3087638
TypeSmall organic molecule
Emp. Form.C17H26IN7O5
Mol. Mass.535.3367
SMILESN[C@@H](CCCN(CCI)C[C@H]1O[C@H]([C@H](O)[C@@H]1O)n1cnc2c(N)ncnc12)C(O)=O