Reaction Details
TargetN-lysine methyltransferase KMT5A
LigandBDBM50075100
Substrate/Competitorn/a
Meas. Tech.ChEMBL_1473626 (CHEMBL3420965)
IC50 500±n/a nM
Citation Kaniskan, HÜKonze, KDJin, J Selective inhibitors of protein methyltransferases. J Med Chem58:1596-629 (2015) 
 
N-lysine methyltransferase KMT5A
Name:N-lysine methyltransferase KMT5A
Type:Enzyme
Mol. Mass.:42919.11
Organism:Homo sapiens (Human)
Description:Q9NQR1
Residue:393
BDBM50075100
NameBDBM50075100
Synonyms:CHEMBL3414625
TypeSmall organic molecule
Emp. Form.C15H12N2O2S
Mol. Mass.284.333
SMILESCc1nc2c(s1)C(=O)C\C(=N/c1ccc(C)cc1)C2=O