Reaction Details
TargetDNA (cytosine-5)-methyltransferase 3A
LigandBDBM50448484
Substrate/Competitorn/a
Meas. Tech.ChEMBL_1473707 (CHEMBL3418013)
IC50 2800±n/a nM
Citation Erdmann, AHalby, LFahy, JArimondo, PB Targeting DNA methylation with small molecules: what's next? J Med Chem58:2569-83 (2015) 
 
DNA (cytosine-5)-methyltransferase 3A
Name:DNA (cytosine-5)-methyltransferase 3A
Type:PROTEIN
Mol. Mass.:101857.24
Organism:Homo sapiens (Human)
Description:ChEMBL_1510405
Residue:912
BDBM50448484
NameBDBM50448484
Synonyms:CHEMBL3126646
TypeSmall organic molecule
Emp. Form.C27H23N7O
Mol. Mass.461.5178
SMILESCc1cc(Nc2cccc(NC(=O)c3cccc(Nc4ccnc5ccccc45)c3)c2)nc(N)n1