Reaction Details
TargetDNA (cytosine-5)-methyltransferase 1
LigandBDBM50075185
Substrate/Competitorn/a
Meas. Tech.ChEMBL_1473706 (CHEMBL3418012)
IC50 19000±n/a nM
Citation Erdmann, AHalby, LFahy, JArimondo, PB Targeting DNA methylation with small molecules: what's next? J Med Chem58:2569-83 (2015) 
 
DNA (cytosine-5)-methyltransferase 1
Name:DNA (cytosine-5)-methyltransferase 1
Type:Enzyme
Mol. Mass.:183184.85
Organism:Homo sapiens (Human)
Description:P26358
Residue:1616
BDBM50075185
NameBDBM50075185
Synonyms:CHEMBL3414632
TypeSmall organic molecule
Emp. Form.C26H19NO11
Mol. Mass.521.4292
SMILESCC(=O)NCCc1ccc(O)c(c1)-c1cc2C(=O)c3c(cc(O)c(C(O)=O)c3C(O)=O)C(=O)c2c(O)c1O